serviços de aluguer
type: Concept
preferred label: خدمات تأجير @ar
preferred label: Mietservice @de
preferred label: rental service @en-gb
preferred label: Rentadoras @es
preferred label: Uthyrningsfirmor @se
preferred label: Sociétés de location @fr
preferred label: serviços de locação
preferred label: udlejningsfirma @dk
preferred label: 租赁服务 @zh-hans
preferred label: utleievirksomhet @no-nb
preferred label: utleigeverksemd @no-nn
definition: Companies that provide items on a short-term rental basis, including motor vehicles, clothing, tools, heavy equipment and other supplies @en-gb
definition: Unternehmen, die Vermietungen anbieten, Fahrzeuge, Smokings, Werkzeuge, schwere Ausrüstung und andere Angebote @de
definition: Företag som hyr ut saker, såsom bilar, kläder och verktyg. @se
definition: Empresas que fornecem serviços de aluguer, incluindo veículos, smokings, ferramentas, equipamento pesado e outros bens.
definition: Empresas que fornecem serviços de locação, incluindo veículos, smokings, ferramentas, equipamento pesado e outros bens.
definition: Virksomheder, der udlejer eksempelvis biler, boliger, tøj og værktøj. @dk
definition: 提供租赁服务的公司，包括机动车、晚礼服、工具、重型设备和其他用品的租赁 @zh-hans
in scheme: mediatopic
created: 2009-10-22T02:00:00+00:00
modified: 2023-03-31T12:00:00+00:00
broader: http://cv.iptc.org/newscodes/mediatopic/20001371