Filmindustrin
type: Concept
preferred label: صناعة السينما @ar
preferred label: Industrie du cinéma @fr
preferred label: film industry @en-gb
preferred label: Filmindustrie @de
preferred label: Industria cinematográfica @es
preferred label: indústria cinematográfica @pt-pt
preferred label: filmbranche @dk
preferred label: 电影业 @zh-hans
preferred label: filmbransjen @no-nb
definition: Den kommersiella verksamhet som ägnas åt inspelning, bearbetning, förvärv, distribution, visning, försäljning och uthyrning av film.
definition: The business of making, selling and distributing films @en-gb
definition: Artikel, die sich auf das Filmgeschäft beziehen @de
definition: Histórias relativas ao negócio do cinema. @pt-pt
definition: Kommercielle virksomheder, der er afsat til optagelse, forarbejdning, erhvervelse, distribution, visning, salg og leje af film. @dk
definition: 电影业务 @zh-hans
in scheme: mediatopic
created: 2009-10-22T02:00:00+00:00
modified: 2023-03-31T12:00:00+00:00
broader: http://cv.iptc.org/newscodes/mediatopic/20000304