papir- og emballasjeindustri
type: Concept
preferred label: Productos de papel y embalaje @es
preferred label: Papier et emballage @fr
preferred label: Papper @se
preferred label: Papier und Verpackung @de
preferred label: صناعة الورق والنغليف @ar
preferred label: paper and packaging product @en-gb
preferred label: papel e embalagem @pt-pt
preferred label: papir og emballage @dk
preferred label: 纸张和包装产品 @zh-hans
definition: Produktion von Papiermaterial zum Schreiben, Einwickeln, Drucken oder Verpacken. @de
definition: Production of paper material for writing, wrapping, printing, or packaging @en-gb
definition: Tillverkning av papper för att skriva, slå in, trycka eller paketera. @se
definition: Produção de papel para escrever, embrulhar, imprimir ou embalar. @pt-pt
definition: Fremstilling af papir til skrivning, indpakning, trykning eller emballering. @dk
definition: 用于书写、包装、印刷或包裹用途的纸张材料的生产 @zh-hans
definition: Framstilling av papir for skriving, trykking, pakking og emballasje.
definition: Fremstilling av papir for skriving, trykking, pakking og emballasje
in scheme: mediatopic
created: 2009-10-22T02:00:00+00:00
modified: 2023-03-31T12:00:00+00:00
retired: 2023-03-31T12:00:00+00:00
broader: http://cv.iptc.org/newscodes/mediatopic/20000322