Wirtschaft
type: Concept
preferred label: Economía @es
preferred label: economy @en-gb
preferred label: Économie @fr
preferred label: Ekonomi @se
preferred label: اقتصاد @ar
preferred label: economia (geral) @pt-pt
preferred label: økonomi @dk
preferred label: 经济 @zh-hans
definition: Production, consumption, distribution and trade activities affecting regions or countries as a whole @en-gb
definition: Inhalte grundsätzlicher Art über Handel und Ökonomie
definition: Saker som rör handel och ekonomin. @se
definition: Conteúdo geral sobre comércio e economia. @pt-pt
definition: Sager relateret til handel og økonomi. @dk
definition: 关于贸易和经济的一般性内容 @zh-hans
in scheme: mediatopic
created: 2009-10-22T02:00:00+00:00
modified: 2024-03-28T12:00:00+00:00
broader: http://cv.iptc.org/newscodes/mediatopic/04000000
narrower: http://cv.iptc.org/newscodes/mediatopic/20000346
narrower: http://cv.iptc.org/newscodes/mediatopic/20000350
narrower: http://cv.iptc.org/newscodes/mediatopic/20000355
narrower: http://cv.iptc.org/newscodes/mediatopic/20000363
narrower: http://cv.iptc.org/newscodes/mediatopic/20000364
narrower: http://cv.iptc.org/newscodes/mediatopic/20000372
narrower: http://cv.iptc.org/newscodes/mediatopic/20000373
narrower: http://cv.iptc.org/newscodes/mediatopic/20000379
narrower: http://cv.iptc.org/newscodes/mediatopic/20000381
narrower: http://cv.iptc.org/newscodes/mediatopic/20001171