债券
type: Concept
definition: 包括政府和企业发行的债券，债券认购人以固定利率向发债公司或政府提供一定期限的贷款
in scheme: mediatopic
created: 2009-10-22T02:00:00+00:00
modified: 2024-03-28T12:00:00+00:00
retired: 2024-03-28T12:00:00+00:00
broader: http://cv.iptc.org/newscodes/mediatopic/20000346