produto interno bruto
type: Concept
definition: Indicador económico do valor monetário da produção num território, comummente abreviado como PIB.
in scheme: mediatopic
created: 2009-10-22T02:00:00+00:00
modified: 2024-03-28T12:00:00+00:00
broad match: http://cv.iptc.org/newscodes/subjectcode/04000000
broader: http://cv.iptc.org/newscodes/mediatopic/20000346