Produktivität
type: Concept
preferred label: Produktivitet @se
preferred label: productivity @en-gb
preferred label: Productividad @es
preferred label: انتاجية @ar
preferred label: Productivité @fr
preferred label: produtividade @pt-pt
preferred label: produktivitet @dk
preferred label: 生产能力 @zh-hans
definition: A measure of output from production or service @en-gb
definition: Messlatte für die Produktion von Gütern oder Dienstleistungen
definition: Förhållandet mellan erhållet resultat och insatta resurser vid industriell produktion. @se
definition: Custo de produção de um item de valor, geralmente medido como o rendimento por hora e por pessoa. @pt-pt
definition: Forholdet mellem det opnåede resultat og de ressourcer, der er investeret i industriel produktion. @dk
definition: 度量生产和服务产出 @zh-hans
in scheme: mediatopic
created: 2009-10-22T02:00:00+00:00
modified: 2024-03-28T12:00:00+00:00
broader: http://cv.iptc.org/newscodes/mediatopic/20000346