国际经济机构
type: Concept
definition: 联合国工业发展组织、世界银行、世界贸易组织、进出口银行等这类在国际范围开展业务的实体
in scheme: mediatopic
created: 2009-10-22T02:00:00+00:00
modified: 2024-07-01T12:00:00+00:00
broader: http://cv.iptc.org/newscodes/mediatopic/20000344