Handelsbeschränkung
type: Concept
definition: Regierungsentscheidungen über Tarife, Verschiffung, Embargos und welche Güter und Dienstleistungen
in scheme: mediatopic
created: 2009-10-22T02:00:00+00:00
modified: 2024-03-28T12:00:00+00:00
broader: http://cv.iptc.org/newscodes/mediatopic/20000373