Fachhochschule
type: Concept
definition: Institution der Lehre auf höherer Ebene, spezielle Form variiert von Land zu Land
in scheme: mediatopic
created: 2009-10-22T02:00:00+00:00
retired: 2021-09-30T12:00:00+00:00
modified: 2021-09-30T12:00:00+00:00
broader: http://cv.iptc.org/newscodes/mediatopic/20000405
broad match: http://cv.iptc.org/newscodes/subjectcode/05000000