全球气候变暖
type: Concept
definition: 这一分类包括与全球变暖有关的所有问题，包括气温研究、对温度变化趋势的遥感、关于全球变暖的讨论、减少排放的方法和碳交易
in scheme: mediatopic
created: 2009-10-22T02:00:00+00:00
modified: 2025-06-30T12:00:00+00:00
retired: 2025-06-30T12:00:00+00:00
broader: http://cv.iptc.org/newscodes/mediatopic/20000418