sykdommer og sykdomstilstander
type: Concept
preferred label: Maladies et état de santé @fr
preferred label: Krankheit @de
preferred label: Sjukdomar och sjukdomstillstånd @se
preferred label: امراض وظروف @ar
preferred label: disease and condition @en-gb
preferred label: Enfermedades @es
preferred label: doenças e condições @pt-pt
preferred label: sygdom og sygdomstilstand @dk
preferred label: 疾病和病况 @zh-hans
preferred label: sjukdommar og sjukdomstilstandar
definition: Any health conditions affecting humans @en-gb
definition: Jeder gesundheitsgefährdende oder zerstörerische Zustand @de
definition: Alla skadliga eller destruktiva hälsotillstånd som påverkar människor. @se
definition: Qualquer condição de saúde lesiva ou destrutiva que afete seres humanos. @pt-pt
definition: Enhver skadelig eller destruktiv helbredstilstand, der påvirker mennesker. @dk
definition: 影响人类的所有有害或破坏性的健康状况 @zh-hans
definition: Alle helsetilstandar som påverkar menneske.
definition: Alle helsetilstander som påvirker mennesker
in scheme: mediatopic
created: 2009-10-22T02:00:00+00:00
modified: 2022-06-14T12:00:00+00:00
broader: http://cv.iptc.org/newscodes/mediatopic/07000000
narrower: http://cv.iptc.org/newscodes/mediatopic/20000447
narrower: http://cv.iptc.org/newscodes/mediatopic/20000448
narrower: http://cv.iptc.org/newscodes/mediatopic/20000454
narrower: http://cv.iptc.org/newscodes/mediatopic/20000455
narrower: http://cv.iptc.org/newscodes/mediatopic/20000456
narrower: http://cv.iptc.org/newscodes/mediatopic/20000457
narrower: http://cv.iptc.org/newscodes/mediatopic/20000458
narrower: http://cv.iptc.org/newscodes/mediatopic/20001322
narrower: http://cv.iptc.org/newscodes/mediatopic/20001355
broad match: http://cv.iptc.org/newscodes/subjectcode/07001000