meios complementares de diagnóstico e terapêutica
type: Concept
preferred label: Exámen/procedimiento médico @es
preferred label: medical test @en-gb
preferred label: Medizinische Untersuchung @de
preferred label: Protocole médical @fr
preferred label: اجراءات/فحوص طبية @ar
preferred label: Medicinska tester @se
preferred label: meios complementares de diagnóstico
preferred label: medicinsk kontrol og prøve @dk
preferred label: 医疗程序/测试 @zh-hans
preferred label: medisinsk testing @no-nb
definition: Diagnostic procedure, such as stress test, blood test, CAT scan or MRI @en-gb
definition: Medicinska analysprocedurer såsom blodprov, stresstester, skiktröntgen, magnetisk resonanstomografi med mera. @se
definition: Jede Variation der Behandlung wie Stresstests, Katheterisieren, Bluttests, CT oder MCR. @de
definition: Variedade de tratamentos, como testes de stress, cateterização, análises ao sangue, tomografia axial computadorizada, ressonância magnética, etc.
definition: Variedade de tratamentos, como testes de estresse, cateterização, exames de sangue, tomografia computadorizada, ressonância magnética etc.
definition: Medicinske analyseprocedurer såsom blodprøver, stresstest, røntgenstråler, MR-scanning og mere. @dk
definition: 任何一种治疗方法，如压力测试、导管插入术、血液检测、计算机轴向断层扫描(CT)和磁共振成像等 @zh-hans
in scheme: mediatopic
created: 2009-10-22T02:00:00+00:00
modified: 2022-06-14T12:00:00+00:00
broader: http://cv.iptc.org/newscodes/mediatopic/20000464