Örtmedicin
type: Concept
preferred label: Hierbas medicinales @es
preferred label: herbal medicine @en-gb
preferred label: اعشاب @ar
preferred label: Phytothérapie @fr
preferred label: Homöopathie @de
preferred label: fitoterapia @pt-pt
preferred label: urtemedicin @dk
preferred label: 草药医学 @zh-hans
preferred label: naturmedisin @no-nb
definition: Behandlung, die auf der Nutzung von Kräutern und anderen Pflanzen beruht, um Krankheitssymptomen vorzubeugen oder zu heilen @de
definition: Treatment based on the use of herbs and other plants to cure or alleviate symptoms @en-gb
definition: Benämning på medel, huvudsakligen avsedda för egenbehandling, vilka utgörs av torkade växtdelar eller extrakt av sådana som används för att bota sjukdomar.
definition: Tratamento baseado no uso de ervas e de outras plantas para curar ou aliviar sintomas de doença. @pt-pt
definition: Behandling baseret på brugen af urter og andre planter til at kurere eller lindre sygdomssymptomer. @dk
definition: 基于草药和其他植物治疗来减轻疾病症状的治疗方法 @zh-hans
in scheme: mediatopic
created: 2009-10-22T02:00:00+00:00
modified: 2022-06-14T12:00:00+00:00
broader: http://cv.iptc.org/newscodes/mediatopic/20000470