private health care
type: Concept
preferred label: القطاع الصحي الخاص @ar
preferred label: Private Krankenversicherung @de
preferred label: Soins de santé privés @fr
preferred label: Privat sjukvård @se
preferred label: Medicina privada @es
preferred label: sistemas privados de saúde @pt-pt
preferred label: privat sundhedspleje @dk
preferred label: 私人健康护理 @zh-hans
preferred label: privat helsevesen @no-nb
definition: Health care provided by private organisations
definition: Gesundheitsfürsorge, die von privat finanzierten oder Versicherungsorganisationen unterstützt wird @de
definition: Sjukvård som tillhandahålles av privat finansierade eller försäkrade organisationer. @se
definition: Cuidados de saúde fornecidos por organizações de fundos ou seguros privados. @pt-pt
definition: Sundhedsydelser leveret af privatfinansierede organisationer. @dk
definition: 私人资助或保险机构提供的医疗保健服务 @zh-hans
definition: Health care provided by private organizations
in scheme: mediatopic
created: 2009-10-22T02:00:00+00:00
modified: 2022-06-14T12:00:00+00:00
broader: http://cv.iptc.org/newscodes/mediatopic/07000000