Tier
type: Concept
preferred label: Animales @es
preferred label: Djur @se
preferred label: animal @en-gb
preferred label: Animaux @fr
preferred label: حيوان @ar
preferred label: animais @pt-pt
preferred label: dyr @dk
preferred label: 动物 @zh-hans
definition: All animals, including pets, wildlife, insects, and livestock @en-gb
definition: Nyheter om djur där fokus ligger på känslomässiga saker. @se
definition: Tiere mit Blick auf emotionale Aspekte
definition: Itens sobre animais, com foco em facetas emocionais. @pt-pt
definition: Nyheder om dyr. @dk
definition: 关注情感层面的动物条目 @zh-hans
in scheme: mediatopic
created: 2009-10-22T02:00:00+00:00
modified: 2025-10-09T12:00:00+00:00
broader: http://cv.iptc.org/newscodes/mediatopic/20000441
narrower: http://cv.iptc.org/newscodes/mediatopic/20000494
narrower: http://cv.iptc.org/newscodes/mediatopic/20001318