estagiários e aprendizes
type: Concept
preferred label: Ausbildung @de
preferred label: Apprentissage @fr
preferred label: apprenticeship @en-gb
preferred label: Aprendices @es
preferred label: مبتدئون/متدربون @ar
preferred label: Lärlingar @se
preferred label: lærling @dk
preferred label: 学徒 @zh-hans
definition: A period of work used to learn a skill or trade @en-gb
definition: Menschen, die sich lernend im Arbeitsprozess befinden und von einem Ausbilder betreut werden @de
definition: Den som lär ett yrke, oftast ett hantverksyrke, genom att arbeta tillsammans med någon tidigare yrkesutbildad. @se
definition: Pessoas que fazem parte de uma força de trabalho num nível inicial, aprendendo a profissão sob a direção de alguém.
definition: Pessoas que fazem parte de uma força de trabalho em nível inicial, aprendendo a profissão sob a direção de alguém.
definition: Enhver, der undervises i et erhverv, normalt et håndværk, ved at arbejde med nogen, der tidligere er blevet uddannet. @dk
definition: 在劳动力中处于学习阶段，在师傅手下工作的人 @zh-hans
in scheme: mediatopic
created: 2009-10-22T02:00:00+00:00
modified: 2021-02-18T12:00:00+00:00
broader: http://cv.iptc.org/newscodes/mediatopic/20000509