ocupações
type: Concept
preferred label: Yrken @se
preferred label: Beruf @de
preferred label: عمل @ar
preferred label: Profession @fr
preferred label: Oficios @es
preferred label: occupations @en-gb
preferred label: profession og faglighed @dk
preferred label: 职业 @zh-hans
preferred label: yrke @no-nb
definition: Typ av arbete som det går att försörja sig på och som kräver vissa särskilda kunskaper. @se
definition: Tätigkeit, Profession oder Geschäft im Allgemeinen, obwohl mit Profession meist Rechtsanwälte und Ärzte, mit Tätigkeit eher Angestellte oder Fernfahrer gemeint sind @de
definition: Generally one's trade, profession or business although professions are usually such things as lawyers and doctors, and occupations are such as clerks or truckers @en-gb
definition: Em geral, ofício, profissão ou negócio, embora as profissões sejam geralmente coisas como advogados e médicos e as ocupações sejam algo como funcionários administrativos ou camionistas.
definition: Em geral, ofício, profissão ou negócio, embora as profissões sejam geralmente coisas como advogados e médicos e as ocupações sejam algo como funcionários administrativos ou caminhoneiros.
definition: Den type arbejde, en person primært beskæftiger sig med. @dk
definition: 通常指一个人的专长、专业或业务，尽管专业通常指医生、律师，而职业通常指职员或司机 @zh-hans
in scheme: mediatopic
created: 2009-10-22T02:00:00+00:00
retired: 2019-10-07T12:00:00+00:00
modified: 2021-02-18T12:00:00+00:00
broader: http://cv.iptc.org/newscodes/mediatopic/20000509