Utomhusspel
type: Concept
preferred label: لعبة خارجية @ar
preferred label: Jeux de plein air @fr
preferred label: Outdoorspiel @de
preferred label: Juego al aire libre @es
preferred label: outdoor game @en-gb
preferred label: jogo de exterior @pt-pt
preferred label: undendørsspil @dk
preferred label: 户外游戏 @zh-hans
preferred label: uteleker @no-nb
preferred label: uteleikar @no-nn
definition: A game played in an open space @en-gb
definition: Spel som utövas utomhus.
definition: Spiel, was draußen gespielt wird @de
definition: Jogo praticado num espaço aberto. @pt-pt
definition: Spil, der udøves udendørs. @dk
definition: 在户外进行的游戏 @zh-hans
in scheme: mediatopic
created: 2009-10-22T02:00:00+00:00
modified: 2021-02-18T12:00:00+00:00
broader: http://cv.iptc.org/newscodes/mediatopic/20000540
broad match: http://cv.iptc.org/newscodes/subjectcode/10001000