jogo eletrónico
type: Concept
preferred label: video game @en-gb
preferred label: Datorspel @se
preferred label: Jeux vidéo @fr
preferred label: Videospiel @de
preferred label: Videojuegos @es
preferred label: لعبة فيديو @ar
preferred label: jogo eletrônico
preferred label: video- og computerspil @dk
preferred label: 视频游戏 @zh-hans
preferred label: videospill @no-nb
preferred label: videospel @no-nn
definition: Benämning på videospel, ett datorspel avsett att kopplas till en tv-apparat, som på sin bildskärm visar spelförloppet. @se
definition: A game played using a video display @en-gb
definition: Spiel, das einen Videobildschirm nutzt @de
definition: Jogo praticado num ecrã de televisão ou num monitor.
definition: Jogo praticado numa tela de televisão ou num monitor.
definition: Digitalt spil, der foregår på en computer, spillekonsol eller mobiltelefon. @dk
definition: 用视频显示器玩的游戏 @zh-hans
in scheme: mediatopic
created: 2009-10-22T02:00:00+00:00
modified: 2021-02-18T12:00:00+00:00
broader: http://cv.iptc.org/newscodes/mediatopic/20000540
broad match: http://cv.iptc.org/newscodes/subjectcode/10001000