Kafé
type: Concept
preferred label: Café @de
preferred label: cafe @en-gb
preferred label: مقهى @ar
preferred label: café @pt-pt
preferred label: 咖啡厅 @zh-hans
preferred label: kafé @no-nb
definition: A small business where drinks and snacks are prepared and served - its specifics may depend on the local culture @en-gb
definition: Geschäft mit der Zubereitung und Bereitstellung von Getränken und kleinen Snacks, spezielle Details in verschiedenen Kulturen @de
definition: Lokal där det framför allt serveras kaffe, te och läskedrycker samt bakverk och smörgåsar.
definition: Pequeno estabelecimento onde são preparadas e servidas ao público bebidas e refeições ligeiras – a sua especificidade pode depender da cultura local. @pt-pt
definition: Lokale, hvor der serveres kaffe, te og læskedrikke samt morgenmad, kager og sandwich. @dk
definition: 提供饮料和小吃的小型企业——具体情况可能取决于当地文化 @zh-hans
in scheme: mediatopic
created: 2009-10-22T02:00:00+00:00
modified: 2021-02-18T12:00:00+00:00
broader: http://cv.iptc.org/newscodes/mediatopic/20000553
broad match: http://cv.iptc.org/newscodes/subjectcode/10000000