Motorcyklar
type: Concept
preferred label: Amateur de moto @fr
preferred label: Afición por la moto @es
preferred label: motorcycle enthusiasm @en-gb
preferred label: شغف بالدراجات النارية @ar
preferred label: Motorrad @de
preferred label: interesse por motas @pt-pt
preferred label: motorcykelentusiasme @dk
preferred label: 摩托车爱好 @zh-hans
preferred label: motorsykkelinteresse @no-nb
definition: Intresse för nya och gamla motorfordon med två eller tre hjul.
definition: Interesse für alte und moderne Motorräder @de
definition: Interest in new and classic motor-powered cycles @en-gb
definition: Interesse por motas novas e clássicas. @pt-pt
definition: Interesse for nye og gamle motorkøretøjer med to eller tre hjul. @dk
definition: 对新型和经典摩托车的兴趣 @zh-hans
in scheme: mediatopic
created: 2009-10-22T02:00:00+00:00
modified: 2021-05-05T12:00:00+00:00
broad match: http://cv.iptc.org/newscodes/subjectcode/10000000
broader: http://cv.iptc.org/newscodes/mediatopic/20000550