intergovernmental elections
type: Concept
preferred label: Élections intergouvernementales @fr
preferred label: Mellanstatliga val @se
preferred label: انتخابات حكومية @ar
preferred label: staatsübergreifende Wahl @de
preferred label: Elecciones intergubernamentales @es
preferred label: eleições intergovernamentais @pt-pt
preferred label: mellemstatsligt valg @dk
preferred label: 政府选举 @zh-hans
preferred label: mellomstatlige valg @no-nb
preferred label: mellomstatlege val @no-nn
definition: Choosing individuals for the leadership of an international organisation, such as the United Nations, European Union, NATO and World Bank
definition: Att välja representanter till ett mellanstatligt styre, t ex Europaparlamentet. @se
definition: Auswahl einzelner Regierungsvertreter für eine staatsübergreifende Organisation @de
definition: Escolha de indivíduos para a chefia de uma organização internacional, como Nações Unidas, União Europeia, NATO ou Banco Mundial. @pt-pt
definition: Escolha de indivíduos para a chefia de uma organização internacional, como Nações Unidas, União Europeia, OTAN ou Banco Mundial. @pt-br
definition: At vælge repræsentanter til en mellemstatslig regering, f.eks. Europa-Parlamentet. @dk
definition: 为政府机构选拔工作人员 @zh-hans
definition: Choosing individuals for the leadership of an international organization, such as the United Nations, European Union, NATO and World Bank
in scheme: mediatopic
created: 2009-10-22T02:00:00+00:00
modified: 2021-07-12T12:00:00+00:00
broader: http://cv.iptc.org/newscodes/mediatopic/20000574
broad match: http://cv.iptc.org/newscodes/subjectcode/11000000