Vorwahl
type: Concept
preferred label: انتخابات تمهيدية @ar
preferred label: Primarias @es
preferred label: Primärval @se
preferred label: Élections primaires @fr
preferred label: primary elections @en-gb
preferred label: eleições primárias @pt-pt
preferred label: primærvalg @dk
preferred label: 初选 @zh-hans
preferred label: primærvalg i USA @no-nb
preferred label: primærval i USA @no-nn
definition: Vorwahlen auf lokaler oder regionaler Ebene, die zu einer regionalen oder nationalen Wahl führen
definition: Preliminary elections or caucuses to choose candidates to represent a political party in a regional or national election @en-gb
definition: Förberedande val för att välja kandidater att representera ett politiskt parti i ett lokalt, regionalt eller nationellt val @se
definition: Eleições primárias locais ou regionais que conduzem a eleições regionais ou nacionais. @pt-pt
definition: Forberedelse af lokale og regionale valg, især i USA, inden for et parti for at give vejledning til at nominere kandidater på regionalt eller nationalt niveau. @dk
definition: 地方或区域一级的初步选举，直至区域或全国选举 @zh-hans
in scheme: mediatopic
created: 2009-10-22T02:00:00+00:00
modified: 2021-07-12T12:00:00+00:00
broader: http://cv.iptc.org/newscodes/mediatopic/20000574