Stimmwahl
type: Concept
preferred label: تصويت @ar
preferred label: Votación @es
preferred label: voting @en-gb
preferred label: Opération de vote @fr
preferred label: Röstning @se
preferred label: votação @pt-pt
preferred label: afstemning @dk
preferred label: 投票 @zh-hans
preferred label: stemmegiving @no-nb
definition: Att rösta för en kandidat, ett parti eller ett initiativ i ett politiskt val, att företräda medborgarna i en politisk församling @se
definition: The act of casting a ballot for a candidate, a party or an initiative in a political election, including voting machines, voting by mail or voter turnout @en-gb
definition: Die Wahl eines Individuums, der die eigenen Interessen in der Regierung vertreten soll
definition: Ato de selecionar uma pessoa para representar os seus interesses no governo. @pt-pt
definition: At vælge den person eller det parti, som vælgeren ønsker, skal repræsentere sine interesser. @dk
definition: 选择一个你愿意在政府中代表你利益的人的行为 @zh-hans
in scheme: mediatopic
created: 2009-10-22T02:00:00+00:00
modified: 2021-02-18T12:00:00+00:00
broader: http://cv.iptc.org/newscodes/mediatopic/20000574