审查
type: Concept
definition: 指任何组织为了控制印刷品、图像、网络上的言论、宗教信仰和思想自由颁布的非官方的各种规范，如电影评级，广告和广播标准
in scheme: mediatopic
created: 2009-10-22T02:00:00+00:00
modified: 2021-02-18T12:00:00+00:00
broader: http://cv.iptc.org/newscodes/mediatopic/20000587