orçamento de estado
type: Concept
preferred label: Statsbudget @se
preferred label: ميزانية حكومية @ar
preferred label: Staatshaushalt @de
preferred label: Presupuesto del gobierno @es
preferred label: Budget du gouvernement @fr
preferred label: government budget @en-gb
preferred label: finanslov @dk
preferred label: 政府预算 @zh-hans
preferred label: statsbudsjett @no-nb
definition: En beräkning i förväg av statens inkomster och utgifter under ett år, budgetår. @se
definition: The proposed expenses and revenues approved by the legislature. @en-gb
definition: Der von der Regierung verkündete nationale Haushalt @de
definition: Despesas e receitas aprovadas pela assembleia legislativa.
definition: Despesas e receitas aprovadas pela câmara legislativa.
definition: Et skøn på forhånd af statens indtægter og udgifter i et år, regnskabsåret. @dk
definition: 立法机关批准的开支和收入。 @zh-hans
in scheme: mediatopic
created: 2009-10-22T02:00:00+00:00
modified: 2025-03-31T12:00:00+00:00
broad match: http://cv.iptc.org/newscodes/subjectcode/11013000
broader: http://cv.iptc.org/newscodes/mediatopic/20000593
narrower: http://cv.iptc.org/newscodes/mediatopic/20000608