política de habitação e urbanismo
type: Concept
preferred label: Wohnungs- und Städtebaupolitik @de
preferred label: Vivienda y planificación urbana @es
preferred label: Urbanisme @fr
preferred label: housing and urban planning policy @en-gb
preferred label: Bostadspolitik och stadsplanering @se
preferred label: تخطيط الاسكان والمدن @ar
preferred label: bolig- og byplanlægningspolitik @dk
preferred label: 住房和城市规划 @zh-hans
preferred label: by- og boligplanlegging @no-nb
preferred label: by- og bustadplanlegging @no-nn
definition: Systematiskt planerande av städer och förorter och byggandet av hus i dessa. @se
definition: Systematic planning of urban and suburban areas and the housing within those areas @en-gb
definition: Systematisches Planen von städtischen und vorstädtischen Gebieten und deren Bebauung @de
definition: Planeamento sistemático de áreas urbanas e suburbanas e da habitação dentro dessas áreas.
definition: Planejamento sistemático de áreas urbanas e suburbanas e da habitação dentro dessas áreas.
definition: Systematisk planlægning af by- og forstadsområder og boliger inden for disse områder. @dk
definition: 系统规划的城市和郊区及其范围内的住房 @zh-hans
in scheme: mediatopic
created: 2009-10-22T02:00:00+00:00
modified: 2025-03-31T12:00:00+00:00
broader: http://cv.iptc.org/newscodes/mediatopic/20000621