Kärnkraftspolitik
type: Concept
preferred label: nuclear policy @en-gb
preferred label: Politique Nucléaire @fr
preferred label: سياسة نووية @ar
preferred label: Atompolitik @de
preferred label: Políticas nucleares @es
preferred label: política nuclear @pt-pt
preferred label: atompolitik @dk
preferred label: 核政策 @zh-hans
preferred label: atompolitikk @no-nb
definition: Politik der Regierung in Bezug auf die Nutzung von nuklearer Energie- oder Waffenproduktion @de
definition: Politik som styr användandet av kärnkraft som energikälla eller som del av en vapenarsenal.
definition: Government policies around the production of use of nuclear power and weapons @en-gb
definition: Políticas governamentais relativas ao uso de energia nuclear para a produção de energia ou de armas. @pt-pt
definition: Politikker, der vedrører kernekraft som energikilde eller som del af et våbenarsenal. @dk
definition: 政府关于将核燃料用于发电或武器的政策 @zh-hans
in scheme: mediatopic
created: 2009-10-22T02:00:00+00:00
modified: 2025-03-31T12:00:00+00:00
broader: http://cv.iptc.org/newscodes/mediatopic/20000621