Lebensmittelkontrolle
type: Concept
preferred label: Reglamento sobre alimentos y bebidas @es
preferred label: Règlement sur les aliments et les boissons @fr
preferred label: food and drink regulations @en-gb
preferred label: قوانين الغذاء والمشروبات @ar
preferred label: Livsmedelspolitik @se
preferred label: regulamentação sobre alimentos e bebidas @pt-pt
preferred label: fødevarepolitik @dk
preferred label: 食品和饮料法规 @zh-hans
preferred label: næringsmiddelpolitikk @no-nb
preferred label: matvarepolitikk @no-nn
definition: Government policies relating to the production and selling of food and drink, including ensuring food safety @en-gb
definition: Politiska program för produktion och försäljning av mat och dryck, inklusive livsmedelssäkerhet. @se
definition: Regierungspolitik bezogen auf Lebensmittel und Getränke
definition: Políticas governamentais relativas a alimentos e bebidas. @pt-pt
definition: Politik, der påvirker mad og drikke. @dk
definition: 与食品和饮料有关的政府政策 @zh-hans
in scheme: mediatopic
created: 2009-10-22T02:00:00+00:00
modified: 2025-03-31T12:00:00+00:00
broad match: http://cv.iptc.org/newscodes/subjectcode/11022000
broader: http://cv.iptc.org/newscodes/mediatopic/20000636