Internationale Beziehung
type: Concept
definition: Nicht gewalttätige Beziehungen zwischen zwei Staaten in Form von Verhandlungen, Verträgen und persönliche Treffen
in scheme: mediatopic
created: 2009-10-22T02:00:00+00:00
modified: 2025-03-31T12:00:00+00:00
broader: http://cv.iptc.org/newscodes/mediatopic/11000000