protestantisme
type: Concept
preferred label: Protestantisme @fr
preferred label: Evangelische Kirche @de
preferred label: Protestantism @en-gb
preferred label: بروتستانت @ar
preferred label: Protestante @es
preferred label: protestante @pt-pt
preferred label: protestant @dk
preferred label: 新教 @zh-hans
definition: En kristen riktning som uppkom genom utbrytning ur den katolska kyrkan och omfattar lutheraner och reformerta. @se
definition: Christian denominations that were formed through the 16th century Reformation movement @en-gb
definition: Oberbegriff für christliche Kirchen und religiöse Gemeinschaften, entstanden aus der Reformation des 16. Jahrhunderts @de
definition: Termo genérico para igrejas cristãs e comunidades religiosas que se formaram durante a Reforma Protestante do séc. XVI. @pt-pt
definition: Generel betegnelse for kristne kirker og religiøse samfund, der udviklede sig gennem reformeringen i det 16. århundrede. @dk
definition: 泛指16世纪通过宗教改革而发展起来的基督教教堂和宗教团体 @zh-hans
definition: Kristne retningar som oppstod under og etter reformasjonen på 1500-talet.
definition: Kristne retninger som oppsto under og etter reforamsjonen på 1500-tallet.
in scheme: mediatopic
created: 2009-10-22T02:00:00+00:00
modified: 2021-12-17T12:00:00+00:00
broader: http://cv.iptc.org/newscodes/mediatopic/20000659
narrower: http://cv.iptc.org/newscodes/mediatopic/20000665
narrower: http://cv.iptc.org/newscodes/mediatopic/20000666
narrower: http://cv.iptc.org/newscodes/mediatopic/20000667
narrower: http://cv.iptc.org/newscodes/mediatopic/20000668
narrower: http://cv.iptc.org/newscodes/mediatopic/20000669
narrower: http://cv.iptc.org/newscodes/mediatopic/20000670