islão
type: Concept
preferred label: Islam @en-gb
preferred label: اسلام @ar
preferred label: islã
preferred label: islam @dk
preferred label: 伊斯兰教 @zh-hans
definition: Monotheistic religion that considers Muhammad as a prophet and the Qur'an as holy scripture @en-gb
definition: Monoteistisk religion som räknar Muhammed som profet och Koranen som helig skrift. @se
definition: Diejenigen die Allah und seine Lehren als Zentrum ihres Glaubens betrachten. @de
definition: Aqueles que usam Alá e os seus ensinamentos como centro da sua crença religiosa.
definition: Aqueles que usam Alá e seus ensinamentos como centro de sua crença religiosa.
definition: Monoteistisk religion, der regner Muhammed som en profet og Koranen som hellig skrift. @dk
definition: 那些以安拉和他的教导为信仰中心的人 @zh-hans
in scheme: mediatopic
created: 2009-10-22T02:00:00+00:00
modified: 2021-12-17T12:00:00+00:00
broader: http://cv.iptc.org/newscodes/mediatopic/20000657
narrower: http://cv.iptc.org/newscodes/mediatopic/20001347
narrower: http://cv.iptc.org/newscodes/mediatopic/20001348