Naturreligioner
type: Concept
preferred label: Naturreligion @de
preferred label: Animisme @fr
preferred label: عبادة الطبيعة @ar
preferred label: Animismo @es
preferred label: nature religion @en-gb
preferred label: religião natural @pt-pt
preferred label: naturreligion @dk
preferred label: 自然宗教 @zh-hans
definition: Dyrkan av naturliga element, såsom eld, vatten, träd och berg, vilket anses förkroppsliga gudomlighet.
definition: Verehrung von Naturelementen wie Feuer, Wasser, Bäume, Berge @de
definition: Religions that believe nature and the natural world is an embodiment of divinity, sacredness or spiritual power, including indigenous religions practiced in various parts of the world, and modern Pagan faiths, such as Wicca @en-gb
definition: Adoração de elementos naturais como fogo, água, árvores, montanhas. @pt-pt
definition: Tilbedelse af naturlige elementer som ild, vand, træer og bjerge. @dk
definition: 崇拜火、水、树、山等自然元素 @zh-hans
in scheme: mediatopic
created: 2009-10-22T02:00:00+00:00
modified: 2021-12-21T12:00:00+00:00
broader: http://cv.iptc.org/newscodes/mediatopic/20000657