líder religioso
type: Concept
definition: Pessoa ou pessoas que têm um papel de liderança ritual, jurídica ou outra na sua igreja ou religião.
in scheme: mediatopic
created: 2009-10-22T02:00:00+00:00
modified: 2021-02-18T12:00:00+00:00
broader: http://cv.iptc.org/newscodes/mediatopic/12000000