Påven
type: Concept
preferred label: Papa @es
preferred label: البابا @ar
preferred label: Papst @de
preferred label: Pape @fr
preferred label: pope @en-gb
preferred label: papa @pt-pt
preferred label: pave @dk
preferred label: 教皇 @zh-hans
definition: Head of the Roman Catholic Church worldwide @en-gb
definition: Den högsta ledaren för romersk-katolska kyrkan.
definition: Weltweites Oberhaupt der römisch-katholischen Kirche @de
definition: Chefe da igreja católica romana no mundo. @pt-pt
definition: Den øverste leder af den romersk-katolske kirke. @dk
definition: 罗马天主教世界领袖 @zh-hans
in scheme: mediatopic
created: 2009-10-22T02:00:00+00:00
modified: 2021-12-17T12:00:00+00:00
broader: http://cv.iptc.org/newscodes/mediatopic/20000703