Mathématiques
type: Concept
preferred label: Matemática @es
preferred label: mathematics @en-gb
preferred label: Mathematik @de
preferred label: رياضيات @ar
preferred label: Matematik @se
preferred label: matemática @pt-pt
preferred label: matematik @dk
preferred label: 数学 @zh-hans
preferred label: matematikk @no-nb
definition: Das Studium von Struktur, Raum, Veränderung und Zahl in abstrakter Form, oft unter Verwendung symbolischer Logik und Sprache, einschließlich Themen wie Geometrie, Algebra oder Trigonometrie @de
definition: The study of structure, space, change and number in abstract, often using symbolic logic and language, and including subjects such as geometry, algebra or trigonometry @en-gb
definition: Vetenskapen om struktur, volym, förändring och abstrakta tal, ofta genom användning av symbolisk logik och språk och inkluderande ämnen såsom trigonometri, geometri och algebra. @se
definition: Etude concrète ou abstraite des nombres, des formes, des structures, de l'espace, basée sur des raisonnements logiques, utilisant souvent un langage symbolique, et incluant des sujets tels que la géométrie, l'algèbre ou la trigonométrie
definition: Estudio concreto o abstracto de números, formas, estructuras, espacio, basado en razonamientos lógicos, a menudo utilizando un lenguaje simbólico, e incluyendo temas como la geometría, el álgebra o la trigonometría @es
definition: Estudo da estrutura, espaço, mudança e número em abstrato, muitas vezes usando lógica e linguagem simbólicas, incluindo disciplinas como a geometria, a álgebra ou a trigonometria. @pt-pt
definition: Undersøgelse af struktur, rum, ændring og antal i abstrakt, ofte ved hjælp af symbolisk logik og sprog, og inkluderer emner som geometri, algebra eller trigonometri. @dk
definition: 对抽象的结构、空间、变化和数字的研究，通常使用符号逻辑和语言，包括几何学、代数或三角学 @zh-hans
in scheme: mediatopic
created: 2009-10-22T02:00:00+00:00
modified: 2021-02-18T12:00:00+00:00
broader: http://cv.iptc.org/newscodes/mediatopic/13000000