biology
type: Concept
preferred label: Biologi @se
preferred label: Biologie @de
preferred label: Biología @es
preferred label: علم الاحياء @ar
preferred label: biologia @pt-pt
preferred label: biologi @dk
preferred label: 生物学 @zh-hans
definition: Vetenskapen om de levande organismerna. @se
definition: The study of the anatomy, behaviour, origin, physiology and other aspects of living organisms
definition: Das Studium der Anatomie, des Verhaltens, der Herkunft, der Physiologie und anderer Aspekte lebender Organismen @de
definition: Etude de l'anatomie, du comportement, de l'origine, de la physiologie et d'autres aspects des organismes vivants @fr
definition: El estudio de la anatomía, comportamiento, origen, fisiología y otros aspectos de los organismos vivos @es
definition: Estudo da anatomia, do comportamento, da origem, da fisiologia e de outros aspetos dos organismos vivos. @pt-pt
definition: Estudo da anatomia, do comportamento, da origem, da fisiologia e de outros aspectos dos organismos vivos. @pt-br
definition: Videnskaben om de levende organismer. @dk
definition: 研究生物的解剖、行为、起源、生理学和其他方面的科学 @zh-hans
definition: The study of the anatomy, behavior, origin, physiology and other aspects of living organisms
in scheme: mediatopic
created: 2009-10-22T02:00:00+00:00
modified: 2021-02-18T12:00:00+00:00
broader: http://cv.iptc.org/newscodes/mediatopic/20000717
narrower: http://cv.iptc.org/newscodes/mediatopic/20000720
narrower: http://cv.iptc.org/newscodes/mediatopic/20000721
narrower: http://cv.iptc.org/newscodes/mediatopic/20000722
narrower: http://cv.iptc.org/newscodes/mediatopic/20000723
narrower: http://cv.iptc.org/newscodes/mediatopic/20000724