botânica
type: Concept
preferred label: Botanik @se
preferred label: botany @en-gb
preferred label: Botánica @es
preferred label: علم نباتات @ar
preferred label: Botanique @fr
preferred label: botanik @dk
preferred label: 植物学 @zh-hans
preferred label: botanikk @no-nb
definition: Untersuchung der physikalischen und physiologischen Struktur, der Genetik, der Ökologie und anderer Aspekte von Pflanzen @de
definition: Vetenskapen om växterna. @se
definition: The study of the physical and physiological structure, genetics, ecology and other aspects of plants @en-gb
definition: Etude de la structure physique et physiologique, de la génétique, de l'écologie et d'autres aspects des plantes @fr
definition: El estudio de la estructura física y fisiológica, la genética, la ecología y otros aspectos de las plantas @es
definition: Estudo da estrutura física e fisiológica, da genética, da ecologia e de outros aspetos das plantas.
definition: Estudo da estrutura física e fisiológica, da genética, da ecologia e de outros aspectos das plantas.
definition: Planternes videnskab. @dk
definition: 研究植物的物理和生理结构、遗传学、生态学等方面的科学 @zh-hans
in scheme: mediatopic
created: 2009-10-22T02:00:00+00:00
modified: 2021-02-18T12:00:00+00:00
broader: http://cv.iptc.org/newscodes/mediatopic/20000719