Química
type: Concept
definition: El estudio de la composición y propiedades de la materia en la escala de átomos y moléculas, y de las reacciones entre compuestos
in scheme: mediatopic
created: 2009-10-22T02:00:00+00:00
modified: 2021-02-18T12:00:00+00:00
broader: http://cv.iptc.org/newscodes/mediatopic/20000717