Horticulture
type: Concept
definition: Etude et l'art de la culture des plantes, comprenant la conception des paysages et des jardins et la conservation des plantes
in scheme: mediatopic
created: 2009-10-22T02:00:00+00:00
modified: 2021-02-18T12:00:00+00:00
broader: http://cv.iptc.org/newscodes/mediatopic/20000717
broad match: http://cv.iptc.org/newscodes/subjectcode/13004000