Meteorología
type: Concept
preferred label: ارصاد جوية @ar
preferred label: Meteorologi @se
preferred label: Meteorologie @de
preferred label: meteorology @en-gb
preferred label: Climatologie @fr
preferred label: meteorologia @pt-pt
preferred label: meteorologi @dk
preferred label: 气象学 @zh-hans
definition: Vetenskapen om atmosfärens fysik och kemi. @se
definition: The study of atmospheric chemistry and physics, with a focus on weather forecasting @en-gb
definition: Studium der Atmosphärenchemie und -physik mit Schwerpunkt Wettervorhersage @de
definition: Etude de la chimie et de la physique de l'atmosphère, en particulier des prévisions météorologiques @fr
definition: El estudio de la química y física atmosférica, con un enfoque en la predicción del tiempo
definition: Estudo da química e da física da atmosfera e física, com o foco na previsão do tempo. @pt-pt
definition: Undersøgelsen af atmosfærisk kemi og fysik med fokus på vejrprognose. @dk
definition: 研究大气及其物理现象的科学，以天气预报为重点 @zh-hans
in scheme: mediatopic
created: 2009-10-22T02:00:00+00:00
modified: 2021-02-18T12:00:00+00:00
broader: http://cv.iptc.org/newscodes/mediatopic/20000717