Physique des particules
type: Concept
preferred label: Teilchenphysik @de
preferred label: Partículas físicas @es
preferred label: فيزياء الجزيئات @ar
preferred label: Partikelfysik @se
preferred label: particle physics @en-gb
preferred label: física de partículas @pt-pt
preferred label: partikelfysik @dk
preferred label: 粒子物理 @zh-hans
preferred label: partikkelfysikk @no-nb
definition: Die Untersuchung der Natur, der Eigenschaften und der Wechselwirkungen der Elementarteilchen, die die Materie ausmachen @de
definition: The study of the nature, properties and interactions of the elementary particles that constitute matter @en-gb
definition: Vetenskapen om materiens minsta beståndsdelar, dessas struktur och inbördes växelverkan. @se
definition: Etude de la nature, des propriétés et des interactions des particules élémentaires constituant la matière
definition: El estudio de la naturaleza, de las propiedades e interacciones de las partículas elementales que constituyen la materia @es
definition: Estudo da natureza, das propriedades e das interações das partículas elementares que constituem matéria. @pt-pt
definition: Videnskaben for de mindste bestanddele af stof, deres struktur og deres interaktion. @dk
definition: 对构成物质的基本粒子的性质、性质和相互作用的研究 @zh-hans
in scheme: mediatopic
created: 2009-10-22T02:00:00+00:00
modified: 2021-02-18T12:00:00+00:00
broader: http://cv.iptc.org/newscodes/mediatopic/20000733