Physique des particules
type: Concept
definition: Etude de la nature, des propriétés et des interactions des particules élémentaires constituant la matière
in scheme: mediatopic
created: 2009-10-22T02:00:00+00:00
modified: 2021-02-18T12:00:00+00:00
broader: http://cv.iptc.org/newscodes/mediatopic/20000733