anthropology
type: Concept
preferred label: Antropología @es
preferred label: Anthropologie @de
preferred label: Antropologi @se
preferred label: علم انسان @ar
preferred label: antropologia @pt-pt
preferred label: antropologi @dk
preferred label: 人类学 @zh-hans
definition: Vetenskapen om människosläktets utveckling och fysiska karakteristika samt världens olika kultur- och samhällstyper. @se
definition: The study of human behaviour and social interactions across time
definition: Die Untersuchung des menschlichen Verhaltens und der sozialen Interaktionen im Zeitablauf @de
definition: Etude du comportement humain et des interactions sociales dans le temps @fr
definition: El estudio del comportamiento humano y las interacciones sociales a lo largo del tiempo @es
definition: Estudo do comportamento humano e das interações sociais ao longo do tempo. @pt-pt
definition: Videnskab af menneskelig adfærd og sociale interaktioner på tværs af tiden. @dk
definition: 研究人类行为和社会互动的学科 @zh-hans
definition: The study of human behavior and social interactions across time
in scheme: mediatopic
created: 2009-10-22T02:00:00+00:00
modified: 2021-02-18T12:00:00+00:00
broader: http://cv.iptc.org/newscodes/mediatopic/20000742