Arqueología
type: Concept
definition: El estudio de la actividad humana a lo largo del tiempo y de la historia cultural a través de artefactos que dejaron los pueblos antiguos
in scheme: mediatopic
created: 2009-10-22T02:00:00+00:00
modified: 2021-02-18T12:00:00+00:00
broader: http://cv.iptc.org/newscodes/mediatopic/20000742