Ciencias de la información
type: Concept
preferred label: Informationswissenschaft @de
preferred label: information science @en-gb
preferred label: Informationsvetenskap @se
preferred label: Sciences de l'information @fr
preferred label: علم المعلومات @ar
preferred label: ciências da informação @pt-pt
preferred label: informationsvidenskab @dk
preferred label: 信息科学 @zh-hans
preferred label: informasjonsvitenskap @no-nb
preferred label: informasjonsvitskap @no-nn
definition: The study and practice of collecting, classifying, storing, retrieving and disseminating information @en-gb
definition: Das Studium und die Praxis des Sammelns, Klassifizierens, Speicherns, Abrufens und Verbreitens von Informationen @de
definition: Brett vetenskapligt område knutet till studier av information, samt behandling av sådan i form av data. @se
definition: Etude et pratique de la collecte, de la classification, du stockage, de la récupération et de la diffusion de l'information @fr
definition: El estudio y la práctica de recopilar, clasificar, almacenar, recuperar y diseminar información
definition: Estudo e prática de recolher, classificar, armazenar, recuperar e disseminar informação. @pt-pt
definition: Videnskaben og praksis med at indsamle, klassificere, lagre, hente og formidle information. @dk
definition: 信息收集、分类、存储、检索和传播的研究与实践 @zh-hans
in scheme: mediatopic
created: 2009-10-22T02:00:00+00:00
modified: 2021-02-18T12:00:00+00:00
broad match: http://cv.iptc.org/newscodes/subjectcode/13003001
broader: http://cv.iptc.org/newscodes/mediatopic/20000742