Ingénierie civile
type: Concept
definition: Etude, conception, développement et construction de structures telles que des bâtiments, des ponts, des tunnels, des systèmes d'irrigation et d'égouts, des rues ou des voies ferrées
in scheme: mediatopic
created: 2009-10-22T02:00:00+00:00
modified: 2021-02-18T12:00:00+00:00
broad match: http://cv.iptc.org/newscodes/subjectcode/13002000
broader: http://cv.iptc.org/newscodes/mediatopic/20000756