engenharia eletrónica
type: Concept
preferred label: electronic engineering @en-gb
preferred label: Elektronik @se
preferred label: الكترونيات @ar
preferred label: Eletrotechnik @de
preferred label: Ingénierie électronique @fr
preferred label: Ingeniería electrónica @es
preferred label: engenharia eletrônica
preferred label: elektronikteknik @dk
preferred label: 电子工程 @zh-hans
preferred label: elektroteknikk @no-nb
definition: Studie, Entwurf, Entwicklung und Anwendung von Systemen, die auf dem Austausch von elektrischen Ladungen basieren, wie z.B. Verbrauchergeräte, Kommunikationssysteme oder Industriecomputer @de
definition: Vetenskap och teknik rörande ledning av elektricitet i vakuum, gaser och halvledare. @se
definition: The study, design, development and application of systems built on the exchange of electrical charges, such as consumer devices, communications systems or industrial computers @en-gb
definition: Etude, conception, développement et application de systèmes basés sur l'échange de charges électriques, tels que les appareils grand public, les systèmes de communication ou les ordinateurs industriels @fr
definition: El estudio, diseño, desarrollo y aplicación de sistemas basados en el intercambio de cargas eléctricas, como dispositivos de consumo, sistemas de comunicaciones o computadoras industriales @es
definition: Estudo, conceção, desenvolvimento e aplicação de sistemas construídos sobre a troca de cargas elétricas, como dispositivos de consumo, sistemas de comunicação ou computadores industriais.
definition: Estudo, concepção, desenvolvimento e aplicação de sistemas construídos sobre a troca de cargas elétricas, como dispositivos de consumo, sistemas de comunicação ou computadores industriais.
definition: Videnskab og teknologi vedrørende ledning af elektricitet i vakuum, gasser og halvledere. @dk
definition: 研究、设计、开发和应用建立在电荷交换基础上的系统，如消费设备、通信系统或工业计算机 @zh-hans
in scheme: mediatopic
created: 2009-10-22T02:00:00+00:00
modified: 2021-02-18T12:00:00+00:00
broader: http://cv.iptc.org/newscodes/mediatopic/20000756