电子工程
type: Concept
definition: 研究、设计、开发和应用建立在电荷交换基础上的系统，如消费设备、通信系统或工业计算机
in scheme: mediatopic
created: 2009-10-22T02:00:00+00:00
modified: 2021-02-18T12:00:00+00:00
broader: http://cv.iptc.org/newscodes/mediatopic/20000756